Reaction Details
TargetNeuropeptide Y receptor type 5
LigandBDBM50301641
Substrate/Competitorn/a
Meas. Tech.ChEMBL_606453 (CHEMBL1074018)
IC50 2.9±n/a nM
Citation Haga, YSakamoto, TShibata, TNonoshita, KIshikawa, MSuga, TTakahashi, HTakahashi, TTakahashi, HAndo, MMurai, TGomori, AOda, ZKitazawa, HMitobe, YKanesaka, MOhe, TIwaasa, HIshii, YIshihara, AKanatani, AFukami, T Discovery of trans-N-[1-(2-fluorophenyl)-3-pyrazolyl]-3-oxospiro[6-azaisobenzofuran-1(3H),1'-cyclohexane]-4'-carboxamide, a potent and orally active neuropeptide Y Y5 receptor antagonist. Bioorg Med Chem17:6971-82 (2009) 
 
Neuropeptide Y receptor type 5
Name:Neuropeptide Y receptor type 5
Type:Enzyme
Mol. Mass.:50746.64
Organism:Homo sapiens (Human)
Description:Q15761
Residue:445
BDBM50301641
NameBDBM50301641
Synonyms:CHEMBL585851 trans-5'-oxo-N-(5-phenylpyrimidin-2-yl)-5'H-spiro[cyclohexane-1,7'-furo[3,4-b]pyridine]-4-carboxamide
TypeSmall organic molecule
Emp. Form.C23H20N4O3
Mol. Mass.400.4299
SMILESO=C(Nc1ncc(cn1)-c1ccccc1)[C@H]1CC[C@@]2(CC1)OC(=O)c1cccnc21