Reaction Details
TargetRAC-alpha serine/threonine-protein kinase
LigandBDBM50304360
Substrate/Competitorn/a
Meas. Tech.ChEMBL_606814 (CHEMBL1068578)
Ki 80±n/a nM
Citation Du-Cuny, LSong, ZMoses, SPowis, GMash, EAMeuillet, EJZhang, S Computational modeling of novel inhibitors targeting the Akt pleckstrin homology domain. Bioorg Med Chem17:6983-92 (2009) 
 
RAC-alpha serine/threonine-protein kinase
Name:RAC-alpha serine/threonine-protein kinase
Type:Enzyme
Mol. Mass.:55681.25
Organism:Homo sapiens (Human)
Description:P31749
Residue:480
BDBM50304360
NameBDBM50304360
Synonyms:BENZENE-1,2,3,4-TETRAYL TETRAKIS[DIHYDROGEN (PHOSPHATE)] benzene-1,2,3,4-tetrayl tetrakis(hydrogen phosphate)
TypeSmall organic molecule
Emp. Form.C6H10O16P4
Mol. Mass.462.029
SMILESOP(O)(=O)Oc1ccc(OP(O)(O)=O)c(OP(O)(O)=O)c1OP(O)(O)=O