Reaction Details
TargetDelta-type opioid receptor
LigandBDBM50304490
Substrate/Competitorn/a
Meas. Tech.ChEMBL_603834 (CHEMBL1045629)
Ki 1.3±n/a nM
Citation Yamamoto, TNair, PMa, SWDavis, PYamamura, HIVanderah, TWPorreca, FLai, JHruby, VJ The biological activity and metabolic stability of peptidic bifunctional compounds that are opioid receptor agonists and neurokinin-1 receptor antagonists with a cystine moiety. Bioorg Med Chem17:7337-43 (2009) 
 
Delta-type opioid receptor
Name:Delta-type opioid receptor
Type:G Protein-Coupled Receptor (GPCR)
Mol. Mass.:40382.98
Organism:Homo sapiens (Human)
Description:Competition binding assays were carried out using membrane preparations from transfected HN9.10 cells that constitutively expressed the delta opioid receptor.
Residue:372
BDBM50304490
NameBDBM50304490
Synonyms:CHEMBL611926 | H-Tyr-c[D-Cys-Gly-Phe-Nle-Pro-Cys]-Trp-NH-[3',5'-(CF3)2Bzl]
TypeSmall organic molecule
Emp. Form.C57H64F6N10O9S2
Mol. Mass.1211.3
SMILESCCCC[C@@H]1NC(=O)[C@H](Cc2ccccc2)NC(=O)CNC(=O)[C@@H](CSSC[C@H](NC(=O)[C@@H]2CCCN2C1=O)C(=O)N[C@@H](Cc1c[nH]c2ccccc12)C(=O)NCc1cc(cc(c1)C(F)(F)F)C(F)(F)F)NC(=O)[C@@H](N)Cc1ccc(O)cc1