Reaction Details
TargetLysophosphatidic acid receptor 1
LigandBDBM50304580
Substrate/Competitorn/a
Meas. Tech.ChEMBL_605126 (CHEMBL1064669)
Ki 48±n/a nM
Citation Fells, JITsukahara, RLiu, JTigyi, GParrill, AL Structure-based drug design identifies novel LPA3 antagonists. Bioorg Med Chem17:7457-64 (2009) 
 
Lysophosphatidic acid receptor 1
Name:Lysophosphatidic acid receptor 1
Type:Enzyme
Mol. Mass.:41120.55
Organism:Homo sapiens (Human)
Description:Q92633
Residue:364
BDBM50304580
NameBDBM50304580
Synonyms:2-(3-(4-nitrophenoxy)phenyl)-1,3-dioxoisoindoline-5-carboxylic acid | CHEMBL604677
TypeSmall organic molecule
Emp. Form.C21H12N2O7
Mol. Mass.404.3292
SMILESOC(=O)c1ccc2C(=O)N(C(=O)c2c1)c1cccc(Oc2ccc(cc2)[N+]([O-])=O)c1