Reaction Details
TargetLysophosphatidic acid receptor 1
LigandBDBM50271765
Substrate/Competitorn/a
Meas. Tech.ChEMBL_605119 (CHEMBL1073933)
IC50 27354±n/a nM
Citation Fells, JITsukahara, RLiu, JTigyi, GParrill, AL Structure-based drug design identifies novel LPA3 antagonists. Bioorg Med Chem17:7457-64 (2009) 
 
Lysophosphatidic acid receptor 1
Name:Lysophosphatidic acid receptor 1
Type:Enzyme
Mol. Mass.:41120.55
Organism:Homo sapiens (Human)
Description:Q92633
Residue:364
BDBM50271765
NameBDBM50271765
Synonyms:3-(4-{3-[4-(3-Carboxy-acryloylamino)-phenoxy]-phenoxy}-phenylcarbamoyl)-acrylic acid CHEMBL482498
TypeSmall organic molecule
Emp. Form.C26H20N2O8
Mol. Mass.488.4456
SMILESOC(=O)\C=C\C(=O)Nc1ccc(Oc2cccc(Oc3ccc(NC(=O)\C=C\C(O)=O)cc3)c2)cc1