Reaction Details
TargetVitamin D3 receptor
LigandBDBM50200182
Substrate/Competitorn/a
Meas. Tech.ChEMBL_606222 (CHEMBL1067955)
EC50 0.3±n/a nM
Citation Barycki, RSicinski, RRPlum, LAGrzywacz, PClagett-Dame, MDeluca, HF Removal of the 20-methyl group from 2-methylene-19-nor-(20S)-1alpha,25-dihydroxyvitamin D(3) (2MD) selectively eliminates bone calcium mobilization activity. Bioorg Med Chem17:7658-69 (2009) 
 
Vitamin D3 receptor
Name:Vitamin D3 receptor
Type:PROTEIN
Mol. Mass.:47811.07
Organism:Rattus norvegicus
Description:ChEMBL_1505946
Residue:423
BDBM50200182
NameBDBM50200182
Synonyms:(1S,3R,5Z,7E)-9,10-secocholesta-5,7,10(19)-triene-1,3,25-triol (1alpha,3beta,5Z,7E)-9,10-secocholesta-5,7,10(19)-triene-1,3,25-triol 1,25-DHCC 1alpha,25-dihydroxycholecalciferol CALCITRIOL | CHEMBL846
TypeSmall organic molecule
Emp. Form.C27H44O3
Mol. Mass.416.6365
SMILESC[C@H](CCCC(C)(C)O)[C@H]1CC[C@H]2\C(CCC[C@]12C)=C\C=C1\C[C@@H](O)C[C@H](O)C1=C