Reaction Details
TargetGlutamate carboxypeptidase 2
LigandBDBM50304714
Substrate/Competitorn/a
Meas. Tech.ChEMBL_605564 (CHEMBL1067318)
Ki 153±n/a nM
Citation Wang, HByun, YBarinka, CPullambhatla, MBhang, HEFox, JJLubkowski, JMease, RCPomper, MG Bioisosterism of urea-based GCPII inhibitors: Synthesis and structure-activity relationship studies. Bioorg Med Chem Lett20:392-7 (2010) 
 
Glutamate carboxypeptidase 2
Name:Glutamate carboxypeptidase 2
Type:PROTEIN
Mol. Mass.:84333.66
Organism:Homo sapiens (Human)
Description:ChEMBL_1497035
Residue:750
BDBM50304714
NameBDBM50304714
Synonyms:2-(4-Hydroxy-3-methoxyphenyl)-2-(3-((S)-1-methoxy-4-methyl-1-oxopentan-2-yl)ureido)acetic acid | CHEMBL595741
TypeSmall organic molecule
Emp. Form.C17H24N2O7
Mol. Mass.368.3817
SMILESCOC(=O)[C@H](CC(C)C)NC(=O)NC(C(O)=O)c1ccc(O)c(OC)c1