Reaction Details
TargetGlutamate carboxypeptidase 2
LigandBDBM50304723
Substrate/Competitorn/a
Meas. Tech.ChEMBL_605563 (CHEMBL1067317)
Ki 52.3±n/a nM
Citation Wang, HByun, YBarinka, CPullambhatla, MBhang, HEFox, JJLubkowski, JMease, RCPomper, MG Bioisosterism of urea-based GCPII inhibitors: Synthesis and structure-activity relationship studies. Bioorg Med Chem Lett20:392-7 (2010) 
 
Glutamate carboxypeptidase 2
Name:Glutamate carboxypeptidase 2
Type:PROTEIN
Mol. Mass.:84333.66
Organism:Homo sapiens (Human)
Description:ChEMBL_1497035
Residue:750
BDBM50304723
NameBDBM50304723
Synonyms:(S)-2-(3-((S)-1-Carboxybutyl)ureido)-6-(4-iodobenzamido)hexanoic acid | CHEMBL595184
TypeSmall organic molecule
Emp. Form.C19H26IN3O6
Mol. Mass.519.3307
SMILESCCC[C@H](NC(=O)N[C@@H](CCCCNC(=O)c1ccc(I)cc1)C(O)=O)C(O)=O