Reaction Details
TargetGlutamate carboxypeptidase 2
LigandBDBM50304733
Substrate/Competitorn/a
Meas. Tech.ChEMBL_605563 (CHEMBL1067317)
Ki 794±n/a nM
Citation Wang, HByun, YBarinka, CPullambhatla, MBhang, HEFox, JJLubkowski, JMease, RCPomper, MG Bioisosterism of urea-based GCPII inhibitors: Synthesis and structure-activity relationship studies. Bioorg Med Chem Lett20:392-7 (2010) 
 
Glutamate carboxypeptidase 2
Name:Glutamate carboxypeptidase 2
Type:PROTEIN
Mol. Mass.:84333.66
Organism:Homo sapiens (Human)
Description:ChEMBL_1497035
Residue:750
BDBM50304733
NameBDBM50304733
Synonyms:(S)-2-(3-((R)-1-Carboxy-2-(furan-2-yl)ethyl)ureido)-6-(4-iodobenzamido)hexanoic acid | CHEMBL593090
TypeSmall organic molecule
Emp. Form.C21H24IN3O7
Mol. Mass.557.3356
SMILESOC(=O)[C@H](CCCCNC(=O)c1ccc(I)cc1)NC(=O)N[C@H](Cc1ccco1)C(O)=O