Reaction Details
TargetGlutamate carboxypeptidase 2
LigandBDBM50304742
Substrate/Competitorn/a
Meas. Tech.ChEMBL_605564 (CHEMBL1067318)
Ki 3000±n/a nM
Citation Wang, HByun, YBarinka, CPullambhatla, MBhang, HEFox, JJLubkowski, JMease, RCPomper, MG Bioisosterism of urea-based GCPII inhibitors: Synthesis and structure-activity relationship studies. Bioorg Med Chem Lett20:392-7 (2010) 
 
Glutamate carboxypeptidase 2
Name:Glutamate carboxypeptidase 2
Type:PROTEIN
Mol. Mass.:84333.66
Organism:Homo sapiens (Human)
Description:ChEMBL_1497035
Residue:750
BDBM50304742
NameBDBM50304742
Synonyms:(S)-3-(2-Carboxy-2-(3-(1-carboxy-3-methylbutyl)ureido)ethyl)benzoic acid | CHEMBL594122
TypeSmall organic molecule
Emp. Form.C17H22N2O7
Mol. Mass.366.3658
SMILESCC(C)C[C@H](NC(=O)N[C@@H](Cc1cccc(c1)C(O)=O)C(O)=O)C(O)=O