Reaction Details
TargetGlutamate carboxypeptidase 2
LigandBDBM50304749
Substrate/Competitorn/a
Meas. Tech.ChEMBL_605563 (CHEMBL1067317)
Ki 3430±n/a nM
Citation Wang, HByun, YBarinka, CPullambhatla, MBhang, HEFox, JJLubkowski, JMease, RCPomper, MG Bioisosterism of urea-based GCPII inhibitors: Synthesis and structure-activity relationship studies. Bioorg Med Chem Lett20:392-7 (2010) 
 
Glutamate carboxypeptidase 2
Name:Glutamate carboxypeptidase 2
Type:PROTEIN
Mol. Mass.:84333.66
Organism:Homo sapiens (Human)
Description:ChEMBL_1497035
Residue:750
BDBM50304749
NameBDBM50304749
Synonyms:(S)-2-(3-(3-Carboxypropyl)ureido)-6-(4-iodobenzamido)hexanoic acid | CHEMBL608106
TypeSmall organic molecule
Emp. Form.C18H24IN3O6
Mol. Mass.505.3041
SMILESOC(=O)CCCNC(=O)N[C@@H](CCCCNC(=O)c1ccc(I)cc1)C(O)=O