Reaction Details
TargetGlutamate carboxypeptidase 2
LigandBDBM50304751
Substrate/Competitorn/a
Meas. Tech.ChEMBL_605563 (CHEMBL1067317)
Ki 11±n/a nM
Citation Wang, HByun, YBarinka, CPullambhatla, MBhang, HEFox, JJLubkowski, JMease, RCPomper, MG Bioisosterism of urea-based GCPII inhibitors: Synthesis and structure-activity relationship studies. Bioorg Med Chem Lett20:392-7 (2010) 
 
Glutamate carboxypeptidase 2
Name:Glutamate carboxypeptidase 2
Type:PROTEIN
Mol. Mass.:84333.66
Organism:Homo sapiens (Human)
Description:ChEMBL_1497035
Residue:750
BDBM50304751
NameBDBM50304751
Synonyms:(S)-2-(3-((S)-1-Carboxybut-3-enyl)ureido)-6-(4-iodobenzamido)hexanoic acid N~2~-{[(1S)-1-carboxybut-3-en-1-yl]carbamoyl}-N~6~-[(4-iodophenyl)carbonyl]-L-lysine
TypeSmall organic molecule
Emp. Form.C19H24IN3O6
Mol. Mass.517.3148
SMILESOC(=O)[C@H](CCCCNC(=O)c1ccc(I)cc1)NC(=O)N[C@@H](CC=C)C(O)=O