Reaction Details
Target5-hydroxytryptamine receptor 2C
LigandBDBM50304808
Substrate/Competitorn/a
Meas. Tech.ChEMBL_606257 (CHEMBL1069947)
Ki 1±n/a nM
Citation Liu, KKCornelius, PPatterson, TAZeng, YSantucci, STomlinson, EGibbons, CMaurer, TSMarala, RBrown, JKong, JXLee, EWerner, WWenzel, ZVage, C Design and synthesis of orally-active and selective azaindane 5HT2c agonist for the treatment of obesity. Bioorg Med Chem Lett20:266-71 (2010) 
 
5-hydroxytryptamine receptor 2C
Name:5-hydroxytryptamine receptor 2C
Type:G Protein-Coupled Receptor (GPCR)
Mol. Mass.:51836.79
Organism:Homo sapiens (Human)
Description:P28335
Residue:458
BDBM50304808
NameBDBM50304808
Synonyms:4-chloro-2-(piperazin-1-yl)thieno[2,3-d]pyrimidine | CHEMBL596327
TypeSmall organic molecule
Emp. Form.C10H11ClN4S
Mol. Mass.254.739
SMILESClc1nc(nc2sccc12)N1CCNCC1