Reaction Details
TargetTGF-beta receptor type-1
LigandBDBM50304839
Substrate/Competitorn/a
Meas. Tech.ChEMBL_606316 (CHEMBL1070008)
Ki 78±n/a nM
Citation Guckian, KCarter, MBLin, EYChoi, MSun, LBoriack-Sjodin, PAChuaqui, CLane, BCheung, KLing, LLee, WC Pyrazolone based TGFbetaR1 kinase inhibitors. Bioorg Med Chem Lett20:326-9 (2010) 
 
TGF-beta receptor type-1
Name:TGF-beta receptor type-1
Type:enzyme
Mol. Mass.:55968.24
Organism:Homo sapiens (Human)
Description:P36897
Residue:503
BDBM50304839
NameBDBM50304839
Synonyms:1,2-dimethyl-4-phenyl-5-(quinoxalin-6-yl)-1H-pyrazol-3(2H)-one | CHEMBL592999
TypeSmall organic molecule
Emp. Form.C19H16N4O
Mol. Mass.316.3565
SMILESCn1c(c(-c2ccccc2)c(=O)n1C)-c1ccc2nccnc2c1