Reaction Details
TargetTGF-beta receptor type-1
LigandBDBM50304847
Substrate/Competitorn/a
Meas. Tech.ChEMBL_606316 (CHEMBL1070008)
Ki 450000±n/a nM
Citation Guckian, KCarter, MBLin, EYChoi, MSun, LBoriack-Sjodin, PAChuaqui, CLane, BCheung, KLing, LLee, WC Pyrazolone based TGFbetaR1 kinase inhibitors. Bioorg Med Chem Lett20:326-9 (2010) 
 
TGF-beta receptor type-1
Name:TGF-beta receptor type-1
Type:enzyme
Mol. Mass.:55968.24
Organism:Homo sapiens (Human)
Description:P36897
Residue:503
BDBM50304847
NameBDBM50304847
Synonyms:2-(1,2-dimethyl-3-oxo-5-(quinoxalin-6-yl)-2,3-dihydro-1H-pyrazol-4-yl)benzonitrile | CHEMBL603853
TypeSmall organic molecule
Emp. Form.C20H15N5O
Mol. Mass.341.366
SMILESCn1c(c(-c2ccccc2C#N)c(=O)n1C)-c1ccc2nccnc2c1