Reaction Details
TargetTGF-beta receptor type-1
LigandBDBM50304867
Substrate/Competitorn/a
Meas. Tech.ChEMBL_606316 (CHEMBL1070008)
Ki>2800000±n/a nM
Citation Guckian, KCarter, MBLin, EYChoi, MSun, LBoriack-Sjodin, PAChuaqui, CLane, BCheung, KLing, LLee, WC Pyrazolone based TGFbetaR1 kinase inhibitors. Bioorg Med Chem Lett20:326-9 (2010) 
 
TGF-beta receptor type-1
Name:TGF-beta receptor type-1
Type:enzyme
Mol. Mass.:55968.24
Organism:Homo sapiens (Human)
Description:P36897
Residue:503
BDBM50304867
NameBDBM50304867
Synonyms:CHEMBL594409 | N-(3-(1,2-dimethyl-3-oxo-5-(quinoxalin-6-yl)-2,3-dihydro-1H-pyrazol-4-yl)phenyl)ethanesulfonamide
TypeSmall organic molecule
Emp. Form.C21H21N5O3S
Mol. Mass.423.488
SMILESCCS(=O)(=O)Nc1cccc(c1)-c1c(-c2ccc3nccnc3c2)n(C)n(C)c1=O