Reaction Details
TargetTGF-beta receptor type-1
LigandBDBM50304873
Substrate/Competitorn/a
Meas. Tech.ChEMBL_606316 (CHEMBL1070008)
Ki 640±n/a nM
Citation Guckian, KCarter, MBLin, EYChoi, MSun, LBoriack-Sjodin, PAChuaqui, CLane, BCheung, KLing, LLee, WC Pyrazolone based TGFbetaR1 kinase inhibitors. Bioorg Med Chem Lett20:326-9 (2010) 
 
TGF-beta receptor type-1
Name:TGF-beta receptor type-1
Type:enzyme
Mol. Mass.:55968.24
Organism:Homo sapiens (Human)
Description:P36897
Residue:503
BDBM50304873
NameBDBM50304873
Synonyms:4-(benzo[c][1,2,5]oxadiazol-5-yl)-1,2-dimethyl-5-(quinoxalin-6-yl)-1H-pyrazol-3(2H)-one | CHEMBL594600
TypeSmall organic molecule
Emp. Form.C19H14N6O2
Mol. Mass.358.3535
SMILESCn1c(c(-c2ccc3nonc3c2)c(=O)n1C)-c1ccc2nccnc2c1