Reaction Details
TargetMetabotropic glutamate receptor 5
LigandBDBM50305056
Substrate/Competitorn/a
Meas. Tech.ChEMBL_602837 (CHEMBL1065281)
IC50 32.0±n/a nM
Citation Spanka, CGlatthar, RDesrayaud, SFendt, MOrain, DTroxler, TVranesic, I Piperidyl amides as novel, potent and orally active mGlu5 receptor antagonists with anxiolytic-like activity. Bioorg Med Chem Lett20:184-8 (2010) 
 
Metabotropic glutamate receptor 5
Name:Metabotropic glutamate receptor 5
Type:Enzyme
Mol. Mass.:132484.72
Organism:Homo sapiens (Human)
Description:n/a
Residue:1212
BDBM50305056
NameBDBM50305056
Synonyms:(R)-(5-chloro-6-(6-methylpyridin-3-ylamino)pyridin-3-yl)(2-ethylpiperidin-1-yl)methanone | CHEMBL593590
TypeSmall organic molecule
Emp. Form.C19H23ClN4O
Mol. Mass.358.865
SMILESCC[C@@H]1CCCCN1C(=O)c1cnc(Nc2ccc(C)nc2)c(Cl)c1