Reaction Details
TargetMetabotropic glutamate receptor 7
LigandBDBM50305056
Substrate/Competitorn/a
Meas. Tech.ChEMBL_603012 (CHEMBL1045615)
IC50>10000±n/a nM
Citation Spanka, CGlatthar, RDesrayaud, SFendt, MOrain, DTroxler, TVranesic, I Piperidyl amides as novel, potent and orally active mGlu5 receptor antagonists with anxiolytic-like activity. Bioorg Med Chem Lett20:184-8 (2010) 
 
Metabotropic glutamate receptor 7
Name:Metabotropic glutamate receptor 7
Type:Enzyme Catalytic Domain
Mol. Mass.:102262.98
Organism:Homo sapiens (Human)
Description:Q14831
Residue:915
BDBM50305056
NameBDBM50305056
Synonyms:(R)-(5-chloro-6-(6-methylpyridin-3-ylamino)pyridin-3-yl)(2-ethylpiperidin-1-yl)methanone | CHEMBL593590
TypeSmall organic molecule
Emp. Form.C19H23ClN4O
Mol. Mass.358.865
SMILESCC[C@@H]1CCCCN1C(=O)c1cnc(Nc2ccc(C)nc2)c(Cl)c1