Reaction Details
TargetTyrosine-protein kinase JAK2
LigandBDBM50305156
Substrate/Competitorn/a
Meas. Tech.ChEMBL_603294 (CHEMBL1049518)
IC50 140±n/a nM
Citation Wang, TLedeboer, MWDuffy, JPSalituro, FGPierce, ACZuccola, HJBlock, EShlyakter, DHogan, JKBennani, YL A novel chemotype of kinase inhibitors: Discovery of 3,4-ring fused 7-azaindoles and deazapurines as potent JAK2 inhibitors. Bioorg Med Chem Lett20:153-6 (2010) 
 
Tyrosine-protein kinase JAK2
Name:Tyrosine-protein kinase JAK2
Type:Protein
Mol. Mass.:130684.68
Organism:Homo sapiens (Human)
Description:O60674
Residue:1132
BDBM50305156
NameBDBM50305156
Synonyms:2-fluoro-4-{8,12,14,16-tetraazatetracyclo[8.6.1.0^{2,7}.0^{13,17}]heptadeca-1(17),2(7),3,5,10,13,15-heptaen-9-yl}phenol | CHEMBL589869
TypeSmall organic molecule
Emp. Form.C19H13FN4O
Mol. Mass.332.3311
SMILESOc1ccc(cc1F)C1Nc2ccccc2-c2ncnc3[nH]cc1c23