Reaction Details
TargetTyrosine-protein kinase JAK2
LigandBDBM50305150
Substrate/Competitorn/a
Meas. Tech.ChEMBL_603293 (CHEMBL1049517)
Ki 0.6±n/a nM
Citation Wang, TLedeboer, MWDuffy, JPSalituro, FGPierce, ACZuccola, HJBlock, EShlyakter, DHogan, JKBennani, YL A novel chemotype of kinase inhibitors: Discovery of 3,4-ring fused 7-azaindoles and deazapurines as potent JAK2 inhibitors. Bioorg Med Chem Lett20:153-6 (2010) 
 
Tyrosine-protein kinase JAK2
Name:Tyrosine-protein kinase JAK2
Type:Protein
Mol. Mass.:130684.68
Organism:Homo sapiens (Human)
Description:O60674
Residue:1132
BDBM50305150
NameBDBM50305150
Synonyms:3-fluoro-4-{8,12,14-triazatetracyclo[8.6.1.0^{2,7}.0^{13,17}]heptadeca-1(17),2(7),3,5,10,13,15-heptaen-9-yl}phenol | CHEMBL602183
TypeSmall organic molecule
Emp. Form.C20H14FN3O
Mol. Mass.331.3431
SMILESOc1ccc(C2Nc3ccccc3-c3ccnc4[nH]cc2c34)c(F)c1