Reaction Details
TargetCarboxypeptidase B
LigandBDBM50305345
Substrate/Competitorn/a
Meas. Tech.ChEMBL_603569 (CHEMBL1069124)
Ki 238±n/a nM
Citation Owen, DRBull, DJBunnage, MEGlossop, MSMaguire, RJStrang, RS Oxygenated analogues of UK-396082 as inhibitors of activated thrombin activatable fibrinolysis inhibitor. Bioorg Med Chem Lett20:92-6 (2010) 
 
Carboxypeptidase B
Name:Carboxypeptidase B
Type:Enzyme
Mol. Mass.:47367.43
Organism:Homo sapiens (Human)
Description:P15086
Residue:417
BDBM50305345
NameBDBM50305345
Synonyms:(S)-2-(2-aminoethoxy)-3-(1-propyl-1H-imidazol-4-yl)propanoic acid | CHEMBL609577
TypeSmall organic molecule
Emp. Form.C11H19N3O3
Mol. Mass.241.2869
SMILESCCCn1cnc(C[C@H](OCCN)C(O)=O)c1