Reaction Details
TargetCarboxypeptidase B
LigandBDBM50305347
Substrate/Competitorn/a
Meas. Tech.ChEMBL_603569 (CHEMBL1069124)
Ki 49±n/a nM
Citation Owen, DRBull, DJBunnage, MEGlossop, MSMaguire, RJStrang, RS Oxygenated analogues of UK-396082 as inhibitors of activated thrombin activatable fibrinolysis inhibitor. Bioorg Med Chem Lett20:92-6 (2010) 
 
Carboxypeptidase B
Name:Carboxypeptidase B
Type:Enzyme
Mol. Mass.:47367.43
Organism:Homo sapiens (Human)
Description:P15086
Residue:417
BDBM50305347
NameBDBM50305347
Synonyms:(S)-2-(2-aminoethoxy)-3-(1-(4-tert-butylphenyl)-1H-imidazol-4-yl)propanoic acid | CHEMBL589646
TypeSmall organic molecule
Emp. Form.C18H25N3O3
Mol. Mass.331.4094
SMILESCC(C)(C)c1ccc(cc1)-n1cnc(C[C@H](OCCN)C(O)=O)c1