Reaction Details
TargetCarboxypeptidase B
LigandBDBM50305353
Substrate/Competitorn/a
Meas. Tech.ChEMBL_603569 (CHEMBL1069124)
Ki>10000±n/a nM
Citation Owen, DRBull, DJBunnage, MEGlossop, MSMaguire, RJStrang, RS Oxygenated analogues of UK-396082 as inhibitors of activated thrombin activatable fibrinolysis inhibitor. Bioorg Med Chem Lett20:92-6 (2010) 
 
Carboxypeptidase B
Name:Carboxypeptidase B
Type:Enzyme
Mol. Mass.:47367.43
Organism:Homo sapiens (Human)
Description:P15086
Residue:417
BDBM50305353
NameBDBM50305353
Synonyms:(+/-)-2-(2-(methylamino)ethoxy)-3-(1-propyl-1H-imidazol-4-yl)propanoic acid | CHEMBL590858
TypeSmall organic molecule
Emp. Form.C12H21N3O3
Mol. Mass.255.3134
SMILESCCCn1cnc(CC(OCCNC)C(O)=O)c1