Reaction Details
TargetBeta-secretase 1
LigandBDBM50305480
Substrate/Competitorn/a
Meas. Tech.ChEMBL_603776 (CHEMBL1042914)
IC50 1080±n/a nM
Citation Nowak, PCole, DCAulabaugh, ABard, JChopra, RCowling, RFan, KYHu, BJacobsen, SJani, MJin, GLo, MCMalamas, MSManas, ESNarasimhan, RReinhart, PRobichaud, AJStock, JRSubrath, JSvenson, KTurner, JWagner, EZhou, PEllingboe, JW Discovery and initial optimization of 5,5'-disubstituted aminohydantoins as potent beta-secretase (BACE1) inhibitors. Bioorg Med Chem Lett20:632-5 (2010) 
 
Beta-secretase 1
Name:Beta-secretase 1
Type:Protein
Mol. Mass.:55755.10
Organism:Homo sapiens (Human)
Description:P56817
Residue:501
BDBM50305480
NameBDBM50305480
Synonyms:2-amino-4-cyclohexyl-1-(3,5-difluorobenzyl)-4-phenyl-1H-imidazol-5(4H)-one | CHEMBL592533
TypeSmall organic molecule
Emp. Form.C22H23F2N3O
Mol. Mass.383.4343
SMILESNC1=NC(C2CCCCC2)(C(=O)N1Cc1cc(F)cc(F)c1)c1ccccc1