Reaction Details
TargetPhosphatidylinositol 4,5-bisphosphate 3-kinase catalytic subunit alpha isoform
LigandBDBM50305663
Substrate/Competitorn/a
Meas. Tech.ChEMBL_604557 (CHEMBL1074729)
IC50 25±n/a nM
Citation Gilbert, AMNowak, PBrooijmans, NBursavich, MGDehnhardt, CSantos, EDFeldberg, LRHollander, IKim, SLombardi, SPark, KVenkatesan, AMMallon, R Novel purine and pyrazolo[3,4-d]pyrimidine inhibitors of PI3 kinase-alpha: Hit to lead studies. Bioorg Med Chem Lett20:636-9 (2010) 
 
Phosphatidylinositol 4,5-bisphosphate 3-kinase catalytic subunit alpha isoform
Name:Phosphatidylinositol 4,5-bisphosphate 3-kinase catalytic subunit alpha isoform
Type:Enzyme Subunit
Mol. Mass.:124294.87
Organism:Homo sapiens (Human)
Description:P42336
Residue:1068
BDBM50305663
NameBDBM50305663
Synonyms:(3-(1-(1-benzylpiperidin-4-yl)-4-morpholino-1H-pyrazolo[3,4-d]pyrimidin-6-yl)phenyl)methanol | CHEMBL603848
TypeSmall organic molecule
Emp. Form.C28H32N6O2
Mol. Mass.484.5927
SMILESOCc1cccc(c1)-c1nc(N2CCOCC2)c2cnn(C3CCN(Cc4ccccc4)CC3)c2n1