Reaction Details
TargetPeptidyl-prolyl cis-trans isomerase NIMA-interacting 1
LigandBDBM50305664
Substrate/Competitorn/a
Meas. Tech.ChEMBL_604567 (CHEMBL1065476)
IC50 10000±n/a nM
Citation Potter, AJRay, SGueritz, LNunns, CLBryant, CJScrace, SFMatassova, NBaker, LDokurno, PRobinson, DASurgenor, AEDavis, BMurray, JBRichardson, CMMoore, JD Structure-guided design of alpha-amino acid-derived Pin1 inhibitors. Bioorg Med Chem Lett20:586-90 (2010) 
 
Peptidyl-prolyl cis-trans isomerase NIMA-interacting 1
Name:Peptidyl-prolyl cis-trans isomerase NIMA-interacting 1
Type:PROTEIN
Mol. Mass.:18248.11
Organism:Homo sapiens (Human)
Description:ChEMBL_1502595
Residue:163
BDBM50305664
NameBDBM50305664
Synonyms:5-cyano-1H-benzo[d]imidazole-2-carboxylic acid | CHEMBL595948
TypeSmall organic molecule
Emp. Form.C9H5N3O2
Mol. Mass.187.1549
SMILESOC(=O)c1nc2ccc(cc2[nH]1)C#N