Reaction Details
TargetMetabotropic glutamate receptor 7
LigandBDBM50305871
Substrate/Competitorn/a
Meas. Tech.ChEMBL_605281 (CHEMBL1069931)
IC50>10000±n/a nM
Citation Nakamura, MKurihara, HSuzuki, GMitsuya, MOhkubo, MOhta, H Isoxazolopyridone derivatives as allosteric metabotropic glutamate receptor 7 antagonists. Bioorg Med Chem Lett20:726-9 (2010) 
 
Metabotropic glutamate receptor 7
Name:Metabotropic glutamate receptor 7
Type:Enzyme
Mol. Mass.:102244.48
Organism:Rattus norvegicus (Rat)
Description:P35400
Residue:915
BDBM50305871
NameBDBM50305871
Synonyms:6-(4-isopropoxyphenyl)-5-methyl-3-phenylisoxazolo[4,5-c]pyridin-4(5H)-one | CHEMBL604891
TypeSmall organic molecule
Emp. Form.C22H20N2O3
Mol. Mass.360.4058
SMILESCC(C)Oc1ccc(cc1)-c1cc2onc(-c3ccccc3)c2c(=O)n1C