Reaction Details
TargetMetabotropic glutamate receptor 7
LigandBDBM50196291
Substrate/Competitorn/a
Meas. Tech.ChEMBL_605281 (CHEMBL1069931)
IC50 26±n/a nM
Citation Nakamura, MKurihara, HSuzuki, GMitsuya, MOhkubo, MOhta, H Isoxazolopyridone derivatives as allosteric metabotropic glutamate receptor 7 antagonists. Bioorg Med Chem Lett20:726-9 (2010) 
 
Metabotropic glutamate receptor 7
Name:Metabotropic glutamate receptor 7
Type:Enzyme
Mol. Mass.:102244.48
Organism:Rattus norvegicus (Rat)
Description:P35400
Residue:915
BDBM50196291
NameBDBM50196291
Synonyms:6-(benzo[d][1,3]dioxol-5-yl)-5-methyl-3-phenylisoxazolo[4,5-c]pyridin-4(5H)-one | CHEMBL399603
TypeSmall organic molecule
Emp. Form.C20H14N2O4
Mol. Mass.346.3362
SMILESCn1c(cc2onc(-c3ccccc3)c2c1=O)-c1ccc2OCOc2c1