Reaction Details
TargetVoltage-dependent calcium channel alpha-2 delta subunit
LigandBDBM50305900
Substrate/Competitorn/a
Meas. Tech.ChEMBL_605315 (CHEMBL1071340)
IC50 19±n/a nM
Citation Blakemore, DCBryans, JSCarnell, PCarr, CLChessum, NEField, MJKinsella, NOsborne, SAWarren, ANWilliams, SC Synthesis and in vivo evaluation of bicyclic gababutins. Bioorg Med Chem Lett20:461-4 (2010) 
 
Voltage-dependent calcium channel alpha-2 delta subunit
Name:Voltage-dependent calcium channel alpha-2 delta subunit
Synonyms:Voltage-dependent calcium channel alpha2delta subunit
Type:PROTEIN
Mol. Mass.:123127.66
Organism:Sus scrofa
Description:ChEMBL_605546
Residue:1091
BDBM50305900
NameBDBM50305900
TypeSmall organic molecule
Emp. Form.C10H17NO2
Mol. Mass.183.2475
SMILESNC[C@@]1(CC(O)=O)C[C@@H]2CCC[C@H]12