Reaction Details
TargetCytochrome P450 2C9
LigandBDBM50305989
Substrate/Competitorn/a
Meas. Tech.ChEMBL_605685 (CHEMBL1071215)
IC50 2000±n/a nM
Citation Gilbert, EJZhou, GWong, MKTong, LShankar, BBHuang, CKelly, JLavey, BJMcCombie, SWChen, LRizvi, RDong, YShu, YKozlowski, JAShih, NYHipkin, RWGonsiorek, WMalikzay, ALunn, CAFavreau, LLundell, DJ Non-aromatic A-ring replacement in the triaryl bis-sulfone CB2 receptor inhibitors. Bioorg Med Chem Lett20:608-11 (2010) 
 
Cytochrome P450 2C9
Name:Cytochrome P450 2C9
Type:Enzyme
Mol. Mass.:55636.33
Organism:Homo sapiens (Human)
Description:P11712
Residue:490
BDBM50305989
NameBDBM50305989
Synonyms:CHEMBL596387 | N-((1-(4-chloro-2-(2-fluorophenylsulfonyl)phenylsulfonyl)-4-methylpiperidin-4-yl)methyl)-1,1,1-trifluoromethanesulfonamide
TypeSmall organic molecule
Emp. Form.C20H21ClF4N2O6S3
Mol. Mass.593.032
SMILESCC1(CNS(=O)(=O)C(F)(F)F)CCN(CC1)S(=O)(=O)c1ccc(Cl)cc1S(=O)(=O)c1ccccc1F