Reaction Details
TargetCytochrome P450 2C9
LigandBDBM50306003
Substrate/Competitorn/a
Meas. Tech.ChEMBL_605685 (CHEMBL1071215)
IC50 1000±n/a nM
Citation Gilbert, EJZhou, GWong, MKTong, LShankar, BBHuang, CKelly, JLavey, BJMcCombie, SWChen, LRizvi, RDong, YShu, YKozlowski, JAShih, NYHipkin, RWGonsiorek, WMalikzay, ALunn, CAFavreau, LLundell, DJ Non-aromatic A-ring replacement in the triaryl bis-sulfone CB2 receptor inhibitors. Bioorg Med Chem Lett20:608-11 (2010) 
 
Cytochrome P450 2C9
Name:Cytochrome P450 2C9
Type:Enzyme
Mol. Mass.:55636.33
Organism:Homo sapiens (Human)
Description:P11712
Residue:490
BDBM50306003
NameBDBM50306003
Synonyms:1,1,1-trifluoro-N-(6-(2-(2-fluorophenylsulfonyl)-5-(trifluoromethyl)phenylsulfonyl)-6-azaspiro[2.5]octan-1-yl)methanesulfonamide | CHEMBL595706
TypeSmall organic molecule
Emp. Form.C21H19F7N2O6S3
Mol. Mass.624.569
SMILESFc1ccccc1S(=O)(=O)c1ccc(cc1S(=O)(=O)N1CCC2(CC2NS(=O)(=O)C(F)(F)F)CC1)C(F)(F)F