Reaction Details
TargetCannabinoid receptor 1
LigandBDBM50211605
Substrate/Competitorn/a
Meas. Tech.ChEMBL_605683 (CHEMBL1071213)
Ki 1600±n/a nM
Citation Gilbert, EJZhou, GWong, MKTong, LShankar, BBHuang, CKelly, JLavey, BJMcCombie, SWChen, LRizvi, RDong, YShu, YKozlowski, JAShih, NYHipkin, RWGonsiorek, WMalikzay, ALunn, CAFavreau, LLundell, DJ Non-aromatic A-ring replacement in the triaryl bis-sulfone CB2 receptor inhibitors. Bioorg Med Chem Lett20:608-11 (2010) 
 
Cannabinoid receptor 1
Name:Cannabinoid receptor 1
Type:G Protein-Coupled Receptor (GPCR)
Mol. Mass.:52868.96
Organism:Homo sapiens (Human)
Description:P21554
Residue:472
BDBM50211605
NameBDBM50211605
Synonyms:(S)-N-(1-(4-(4-chloro-2-(2-fluorophenylsulfonyl)phenylsulfonyl)phenyl)ethyl)-1,1,1-trifluoromethanesulfonamide CHEMBL245742
TypeSmall organic molecule
Emp. Form.C21H16ClF4NO6S3
Mol. Mass.585.996
SMILESC[C@H](NS(=O)(=O)C(F)(F)F)c1ccc(cc1)S(=O)(=O)c1ccc(Cl)cc1S(=O)(=O)c1ccccc1F