Reaction Details
TargetCannabinoid receptor 2
LigandBDBM50306013
Substrate/Competitorn/a
Meas. Tech.ChEMBL_605682 (CHEMBL1071212)
Ki 180±n/a nM
Citation Gilbert, EJZhou, GWong, MKTong, LShankar, BBHuang, CKelly, JLavey, BJMcCombie, SWChen, LRizvi, RDong, YShu, YKozlowski, JAShih, NYHipkin, RWGonsiorek, WMalikzay, ALunn, CAFavreau, LLundell, DJ Non-aromatic A-ring replacement in the triaryl bis-sulfone CB2 receptor inhibitors. Bioorg Med Chem Lett20:608-11 (2010) 
 
Cannabinoid receptor 2
Name:Cannabinoid receptor 2
Type:G Protein-Coupled Receptor (GPCR)
Mol. Mass.:39690.94
Organism:Homo sapiens (Human)
Description:P34972
Residue:360
BDBM50306013
NameBDBM50306013
Synonyms:4-chloro-2-(2-fluorophenylsulfonyl)-N-(4-(trifluoromethylsulfonamido)butyl)benzenesulfonamide | CHEMBL594535
TypeSmall organic molecule
Emp. Form.C17H17ClF4N2O6S3
Mol. Mass.552.968
SMILESFc1ccccc1S(=O)(=O)c1cc(Cl)ccc1S(=O)(=O)NCCCCNS(=O)(=O)C(F)(F)F