Reaction Details
TargetCannabinoid receptor 1
LigandBDBM50306014
Substrate/Competitorn/a
Meas. Tech.ChEMBL_605683 (CHEMBL1071213)
Ki 2500±n/a nM
Citation Gilbert, EJZhou, GWong, MKTong, LShankar, BBHuang, CKelly, JLavey, BJMcCombie, SWChen, LRizvi, RDong, YShu, YKozlowski, JAShih, NYHipkin, RWGonsiorek, WMalikzay, ALunn, CAFavreau, LLundell, DJ Non-aromatic A-ring replacement in the triaryl bis-sulfone CB2 receptor inhibitors. Bioorg Med Chem Lett20:608-11 (2010) 
 
Cannabinoid receptor 1
Name:Cannabinoid receptor 1
Type:G Protein-Coupled Receptor (GPCR)
Mol. Mass.:52868.96
Organism:Homo sapiens (Human)
Description:P21554
Residue:472
BDBM50306014
NameBDBM50306014
Synonyms:CHEMBL594536 | N-(2-(1-(4-chloro-2-(2-fluorophenylsulfonyl)phenylsulfonyl)azetidin-3-yl)ethyl)-1,1,1-trifluoromethanesulfonamide
TypeSmall organic molecule
Emp. Form.C18H17ClF4N2O6S3
Mol. Mass.564.979
SMILESFc1ccccc1S(=O)(=O)c1cc(Cl)ccc1S(=O)(=O)N1CC(CCNS(=O)(=O)C(F)(F)F)C1