Reaction Details
TargetCannabinoid receptor 1
LigandBDBM50306017
Substrate/Competitorn/a
Meas. Tech.ChEMBL_605683 (CHEMBL1071213)
Ki 2200±n/a nM
Citation Gilbert, EJZhou, GWong, MKTong, LShankar, BBHuang, CKelly, JLavey, BJMcCombie, SWChen, LRizvi, RDong, YShu, YKozlowski, JAShih, NYHipkin, RWGonsiorek, WMalikzay, ALunn, CAFavreau, LLundell, DJ Non-aromatic A-ring replacement in the triaryl bis-sulfone CB2 receptor inhibitors. Bioorg Med Chem Lett20:608-11 (2010) 
 
Cannabinoid receptor 1
Name:Cannabinoid receptor 1
Type:G Protein-Coupled Receptor (GPCR)
Mol. Mass.:52868.96
Organism:Homo sapiens (Human)
Description:P21554
Residue:472
BDBM50306017
NameBDBM50306017
Synonyms:CHEMBL604704 | N-((1R,5S,6s)-3-(4-chloro-2-(2-fluorophenylsulfonyl)phenylsulfonyl)-3-azabicyclo[3.1.0]hexan-6-yl)-1,1,1-trifluoromethanesulfonamide
TypeSmall organic molecule
Emp. Form.C18H15ClF4N2O6S3
Mol. Mass.562.963
SMILESFc1ccccc1S(=O)(=O)c1cc(Cl)ccc1S(=O)(=O)N1C[C@H]2[C@@H](C1)[C@@H]2NS(=O)(=O)C(F)(F)F