Reaction Details
TargetCannabinoid receptor 1
LigandBDBM50305989
Substrate/Competitorn/a
Meas. Tech.ChEMBL_605683 (CHEMBL1071213)
Ki 4100±n/a nM
Citation Gilbert, EJZhou, GWong, MKTong, LShankar, BBHuang, CKelly, JLavey, BJMcCombie, SWChen, LRizvi, RDong, YShu, YKozlowski, JAShih, NYHipkin, RWGonsiorek, WMalikzay, ALunn, CAFavreau, LLundell, DJ Non-aromatic A-ring replacement in the triaryl bis-sulfone CB2 receptor inhibitors. Bioorg Med Chem Lett20:608-11 (2010) 
 
Cannabinoid receptor 1
Name:Cannabinoid receptor 1
Type:G Protein-Coupled Receptor (GPCR)
Mol. Mass.:52868.96
Organism:Homo sapiens (Human)
Description:P21554
Residue:472
BDBM50305989
NameBDBM50305989
Synonyms:CHEMBL596387 | N-((1-(4-chloro-2-(2-fluorophenylsulfonyl)phenylsulfonyl)-4-methylpiperidin-4-yl)methyl)-1,1,1-trifluoromethanesulfonamide
TypeSmall organic molecule
Emp. Form.C20H21ClF4N2O6S3
Mol. Mass.593.032
SMILESCC1(CNS(=O)(=O)C(F)(F)F)CCN(CC1)S(=O)(=O)c1ccc(Cl)cc1S(=O)(=O)c1ccccc1F