Reaction Details
TargetAcyl-CoA desaturase 1
LigandBDBM50306132
Substrate/Competitorn/a
Meas. Tech.ChEMBL_606059 (CHEMBL1071958)
IC50 2±n/a nM
Citation Uto, YKiyotsuka, YUeno, YMiyazawa, YKurata, HOgata, TDeguchi, TYamada, MWatanabe, NKonishi, MKurikawa, NTakagi, TWakimoto, SKono, KOhsumi, J Novel spiropiperidine-based stearoyl-CoA desaturase-1 inhibitors: Identification of 1'-{6-[5-(pyridin-3-ylmethyl)-1,3,4-oxadiazol-2-yl]pyridazin-3-yl}-5-(trifluoromethyl)-3,4-dihydrospiro[chromene-2,4'-piperidine]. Bioorg Med Chem Lett20:746-54 (2010) 
 
Acyl-CoA desaturase 1
Name:Acyl-CoA desaturase 1
Type:PROTEIN
Mol. Mass.:41064.54
Organism:Mus musculus
Description:ChEMBL_1462109
Residue:355
BDBM50306132
NameBDBM50306132
Synonyms:1'-(6-(5-(2-(pyridin-3-yl)ethyl)-1,3,4-oxadiazol-2-yl)pyridazin-3-yl)-5-(trifluoromethyl)spiro[chroman-2,4'-piperidine] | CHEMBL593109
TypeSmall organic molecule
Emp. Form.C27H25F3N6O2
Mol. Mass.522.5216
SMILESFC(F)(F)c1cccc2OC3(CCN(CC3)c3ccc(nn3)-c3nnc(CCc4cccnc4)o3)CCc12