Reaction Details
TargetStearoyl-CoA desaturase
LigandBDBM50306112
Substrate/Competitorn/a
Meas. Tech.ChEMBL_606060 (CHEMBL1071959)
IC50 0.48±n/a nM
Citation Uto, YKiyotsuka, YUeno, YMiyazawa, YKurata, HOgata, TDeguchi, TYamada, MWatanabe, NKonishi, MKurikawa, NTakagi, TWakimoto, SKono, KOhsumi, J Novel spiropiperidine-based stearoyl-CoA desaturase-1 inhibitors: Identification of 1'-{6-[5-(pyridin-3-ylmethyl)-1,3,4-oxadiazol-2-yl]pyridazin-3-yl}-5-(trifluoromethyl)-3,4-dihydrospiro[chromene-2,4'-piperidine]. Bioorg Med Chem Lett20:746-54 (2010) 
 
Stearoyl-CoA desaturase
Name:Stearoyl-CoA desaturase
Type:Enzyme
Mol. Mass.:41537.27
Organism:Homo sapiens (Human)
Description:O00767
Residue:359
BDBM50306112
NameBDBM50306112
Synonyms:CHEMBL595247 | N-(2-hydroxy-2-phenylethyl)-6-(4-hydroxyspiro[chroman-2,4'-piperidine]-1'-yl)pyridazine-3-carboxamide
TypeSmall organic molecule
Emp. Form.C26H28N4O4
Mol. Mass.460.5249
SMILESOC(CNC(=O)c1ccc(nn1)N1CCC2(CC1)CC(O)c1ccccc1O2)c1ccccc1