Reaction Details
TargetCoagulation factor X
LigandBDBM50306152
Substrate/Competitorn/a
Meas. Tech.ChEMBL_606078 (CHEMBL1071977)
Ki 6.2±n/a nM
Citation Kleanthous, SBorthwick, ADBrown, DBurns-Kurtis, CLCampbell, MChaudry, LChan, CClarte, MOConvery, MAHarling, JDHortense, EIrving, WRIrvine, SPateman, AJPatikis, ANPinto, ILPollard, DRRoethka, TJSenger, SShah, GPStelman, GJToomey, JRWatson, NSWest, RIWhittaker, CZhou, PYoung, RJ Structure and property based design of factor Xa inhibitors: pyrrolidin-2-ones with monoaryl P4 motifs. Bioorg Med Chem Lett20:618-22 (2010) 
 
Coagulation factor X
Name:Coagulation factor X
Type:Enzyme
Mol. Mass.:54726.60
Organism:Homo sapiens (Human)
Description:n/a
Residue:488
BDBM50306152
NameBDBM50306152
Synonyms:(S)-2-(5-chlorothiophen-2-yl)-N-(1-(2-fluoro-4-(prop-1-en-2-yl)phenyl)-2-oxopyrrolidin-3-yl)ethenesulfonamide | CHEMBL594085
TypeSmall organic molecule
Emp. Form.C19H18ClFN2O3S2
Mol. Mass.440.939
SMILESCC(=C)c1ccc(N2CC[C@H](NS(=O)(=O)\C=C\c3ccc(Cl)s3)C2=O)c(F)c1