Reaction Details
TargetCannabinoid receptor 1
LigandBDBM50306221
Substrate/Competitorn/a
Meas. Tech.ChEMBL_606748 (CHEMBL1065338)
IC50 0.54±n/a nM
Citation Receveur, JMMurray, ALinget, JMNørregaard, PKCooper, MBjurling, ENielsen, PAHögberg, T Conversion of 4-cyanomethyl-pyrazole-3-carboxamides into CB1 antagonists with lowered propensity to pass the blood-brain-barrier. Bioorg Med Chem Lett20:453-7 (2010) 
 
Cannabinoid receptor 1
Name:Cannabinoid receptor 1
Type:G Protein-Coupled Receptor (GPCR)
Mol. Mass.:52868.96
Organism:Homo sapiens (Human)
Description:P21554
Residue:472
BDBM50306221
NameBDBM50306221
Synonyms:2-(1-(2-chlorophenyl)-5-(4-chlorophenyl)-3-(4-(2-fluorophenyl)piperidine-1-carbonyl)-1H-pyrazol-4-yl)-N-hydroxyacetimidamide | CHEMBL596376
TypeSmall organic molecule
Emp. Form.C29H26Cl2FN5O2
Mol. Mass.566.453
SMILESONC(=N)Cc1c(nn(c1-c1ccc(Cl)cc1)-c1ccccc1Cl)C(=O)N1CCC(CC1)c1ccccc1F