Reaction Details
TargetCannabinoid receptor 1
LigandBDBM50306230
Substrate/Competitorn/a
Meas. Tech.ChEMBL_606748 (CHEMBL1065338)
IC50 1.2±n/a nM
Citation Receveur, JMMurray, ALinget, JMNørregaard, PKCooper, MBjurling, ENielsen, PAHögberg, T Conversion of 4-cyanomethyl-pyrazole-3-carboxamides into CB1 antagonists with lowered propensity to pass the blood-brain-barrier. Bioorg Med Chem Lett20:453-7 (2010) 
 
Cannabinoid receptor 1
Name:Cannabinoid receptor 1
Type:G Protein-Coupled Receptor (GPCR)
Mol. Mass.:52868.96
Organism:Homo sapiens (Human)
Description:P21554
Residue:472
BDBM50306230
NameBDBM50306230
Synonyms:4-(2-amino-2-iminoethyl)-1-(2-chlorophenyl)-5-(4-chlorophenyl)-N-(4-fluorobenzyl)-1H-pyrazole-3-carboxamide | CHEMBL595946
TypeSmall organic molecule
Emp. Form.C25H20Cl2FN5O
Mol. Mass.496.364
SMILESNC(=N)Cc1c(nn(c1-c1ccc(Cl)cc1)-c1ccccc1Cl)C(=O)NCc1ccc(F)cc1