Reaction Details
TargetCannabinoid receptor 1
LigandBDBM50306233
Substrate/Competitorn/a
Meas. Tech.ChEMBL_606748 (CHEMBL1065338)
IC50 1.2±n/a nM
Citation Receveur, JMMurray, ALinget, JMNørregaard, PKCooper, MBjurling, ENielsen, PAHögberg, T Conversion of 4-cyanomethyl-pyrazole-3-carboxamides into CB1 antagonists with lowered propensity to pass the blood-brain-barrier. Bioorg Med Chem Lett20:453-7 (2010) 
 
Cannabinoid receptor 1
Name:Cannabinoid receptor 1
Type:G Protein-Coupled Receptor (GPCR)
Mol. Mass.:52868.96
Organism:Homo sapiens (Human)
Description:P21554
Residue:472
BDBM50306233
NameBDBM50306233
Synonyms:2-(1-(2-chlorophenyl)-5-(4-chlorophenyl)-3-(4-(5-cyanopyridin-2-yl)piperazine-1-carbonyl)-1H-pyrazol-4-yl)acetamide | CHEMBL605522
TypeSmall organic molecule
Emp. Form.C28H23Cl2N7O2
Mol. Mass.560.434
SMILESNC(=O)Cc1c(nn(c1-c1ccc(Cl)cc1)-c1ccccc1Cl)C(=O)N1CCN(CC1)c1ccc(cn1)C#N