Reaction Details
TargetCannabinoid receptor 1
LigandBDBM50306231
Substrate/Competitorn/a
Meas. Tech.ChEMBL_607001 (CHEMBL1074629)
IC50 0.55±n/a nM
Citation Receveur, JMMurray, ALinget, JMNørregaard, PKCooper, MBjurling, ENielsen, PAHögberg, T Conversion of 4-cyanomethyl-pyrazole-3-carboxamides into CB1 antagonists with lowered propensity to pass the blood-brain-barrier. Bioorg Med Chem Lett20:453-7 (2010) 
 
Cannabinoid receptor 1
Name:Cannabinoid receptor 1
Type:G Protein-Coupled Receptor (GPCR)
Mol. Mass.:52868.96
Organism:Homo sapiens (Human)
Description:P21554
Residue:472
BDBM50306231
NameBDBM50306231
Synonyms:4-(2-amino-2-oxoethyl)-1-(2-chlorophenyl)-5-(4-chlorophenyl)-N-(4-methylpyridin-3-yl)-1H-pyrazole-3-carboxamide | CHEMBL595234
TypeSmall organic molecule
Emp. Form.C24H19Cl2N5O2
Mol. Mass.480.346
SMILESCc1ccncc1NC(=O)c1nn(c(c1CC(N)=O)-c1ccc(Cl)cc1)-c1ccccc1Cl