Reaction Details
TargetCannabinoid receptor 1
LigandBDBM50306237
Substrate/Competitorn/a
Meas. Tech.ChEMBL_607001 (CHEMBL1074629)
IC50 23±n/a nM
Citation Receveur, JMMurray, ALinget, JMNørregaard, PKCooper, MBjurling, ENielsen, PAHögberg, T Conversion of 4-cyanomethyl-pyrazole-3-carboxamides into CB1 antagonists with lowered propensity to pass the blood-brain-barrier. Bioorg Med Chem Lett20:453-7 (2010) 
 
Cannabinoid receptor 1
Name:Cannabinoid receptor 1
Type:G Protein-Coupled Receptor (GPCR)
Mol. Mass.:52868.96
Organism:Homo sapiens (Human)
Description:P21554
Residue:472
BDBM50306237
NameBDBM50306237
Synonyms:1-(4-(2-amino-2-oxoethyl)-1-(2-chlorophenyl)-5-(4-chlorophenyl)-1H-pyrazole-3-carbonyl)-4-(pyridin-2-yl)piperidine-4-carboxylic acid | CHEMBL595463
TypeSmall organic molecule
Emp. Form.C29H25Cl2N5O4
Mol. Mass.578.446
SMILESNC(=O)Cc1c(nn(c1-c1ccc(Cl)cc1)-c1ccccc1Cl)C(=O)N1CCC(CC1)(C(O)=O)c1ccccn1