Reaction Details
TargetCannabinoid receptor 1
LigandBDBM50306232
Substrate/Competitorn/a
Meas. Tech.ChEMBL_607000 (CHEMBL1074628)
IC50 0.34±n/a nM
Citation Receveur, JMMurray, ALinget, JMNørregaard, PKCooper, MBjurling, ENielsen, PAHögberg, T Conversion of 4-cyanomethyl-pyrazole-3-carboxamides into CB1 antagonists with lowered propensity to pass the blood-brain-barrier. Bioorg Med Chem Lett20:453-7 (2010) 
 
Cannabinoid receptor 1
Name:Cannabinoid receptor 1
Type:G Protein-Coupled Receptor (GPCR)
Mol. Mass.:52868.96
Organism:Homo sapiens (Human)
Description:P21554
Residue:472
BDBM50306232
NameBDBM50306232
Synonyms:4-(2-amino-2-oxoethyl)-1-(2-chlorophenyl)-5-(4-chlorophenyl)-N-((1-cyanopiperidin-4-yl)methyl)-1H-pyrazole-3-carboxamide | CHEMBL595462
TypeSmall organic molecule
Emp. Form.C25H24Cl2N6O2
Mol. Mass.511.403
SMILESNC(=O)Cc1c(nn(c1-c1ccc(Cl)cc1)-c1ccccc1Cl)C(=O)NCC1CCN(CC1)C#N