Reaction Details
TargetD(1A) dopamine receptor
LigandBDBM50306444
Substrate/Competitorn/a
Meas. Tech.ChEMBL_609907 (CHEMBL1074769)
Ki 0.6±n/a nM
Citation Sasikumar, TKBurnett, DAGreenlee, WJSmith, MFawzi, AZhang, HLachowicz, JE Remote functionalization of SCH 39166: discovery of potent and selective benzazepine dopamine D1 receptor antagonists. Bioorg Med Chem Lett20:832-5 (2010) 
 
D(1A) dopamine receptor
Name:D(1A) dopamine receptor
Type:Enzyme
Mol. Mass.:49303.43
Organism:Homo sapiens (Human)
Description:P21728
Residue:446
BDBM50306444
NameBDBM50306444
Synonyms:3-((6aS,13bS)-11-chloro-12-hydroxy-7-methyl-6,6a,7,8,9,13b-hexahydro-5H-benzo[d]naphtho[2,1-b]azepin-4-yl)benzonitrile | CHEMBL598105
TypeSmall organic molecule
Emp. Form.C26H23ClN2O
Mol. Mass.414.927
SMILESCN1CCc2cc(Cl)c(O)cc2[C@@H]2[C@@H]1CCc1c2cccc1-c1cccc(c1)C#N