Reaction Details
TargetD(1A) dopamine receptor
LigandBDBM50004823
Substrate/Competitorn/a
Meas. Tech.ChEMBL_609907 (CHEMBL1074769)
Ki 1.2±n/a nM
Citation Sasikumar, TKBurnett, DAGreenlee, WJSmith, MFawzi, AZhang, HLachowicz, JE Remote functionalization of SCH 39166: discovery of potent and selective benzazepine dopamine D1 receptor antagonists. Bioorg Med Chem Lett20:832-5 (2010) 
 
D(1A) dopamine receptor
Name:D(1A) dopamine receptor
Type:Enzyme
Mol. Mass.:49303.43
Organism:Homo sapiens (Human)
Description:P21728
Residue:446
BDBM50004823
NameBDBM50004823
Synonyms:(6aS,13bR)-11-Chloro-7-methyl-5,6a,7,8,9,13b-hexahydro-6H-7-aza-benzo[6,7]cyclohepta[1,2-a]naphthalen-12-ol 11-Chloro-7-methyl-5,6a,7,8,9,13b-hexahydro-6H-7-aza-benzo[6,7]cyclohepta[1,2-a]naphthalen-12-ol Ecopipam trans-(-) 11-Chloro-7-methyl-5,6a,7,8,9,13b-hexahydro-6H-7-aza-benzo[6,7]cyclohepta[1,2-a]naphthalen-12-ol
TypeSmall organic molecule
Emp. Form.C19H20ClNO
Mol. Mass.313.821
SMILESCN1CCc2cc(Cl)c(O)cc2[C@@H]2[C@@H]1CCc1ccccc21