Reaction Details
TargetCannabinoid receptor 2
LigandBDBM50306524
Substrate/Competitorn/a
Meas. Tech.ChEMBL_610882 (CHEMBL1065037)
Ki 782±n/a nM
Citation Burdick, DDeOrazio, RGuzzo, PHabershaw, AHelle, MPaul, BWolf, M Synthesis and structure-activity relationship of substitutions at the C-1 position of Delta9-tetrahydrocannabinol. Bioorg Med Chem Lett20:1424-6 (2010) 
 
Cannabinoid receptor 2
Name:Cannabinoid receptor 2
Type:G Protein-Coupled Receptor (GPCR)
Mol. Mass.:39690.94
Organism:Homo sapiens (Human)
Description:P34972
Residue:360
BDBM50306524
NameBDBM50306524
Synonyms:1-(((6aR,10aR)-6,6,9-trimethyl-3-pentyl-6a,7,8,10a-tetrahydro-6H-benzo[c]chromen-1-yl)methyl)urea | CHEMBL600024
TypeSmall organic molecule
Emp. Form.C23H34N2O2
Mol. Mass.370.5283
SMILESCCCCCc1cc(CNC(N)=O)c2[C@@H]3C=C(C)CC[C@H]3C(C)(C)Oc2c1