Reaction Details
TargetLysine-specific demethylase 4A
LigandBDBM50306581
Substrate/Competitorn/a
Meas. Tech.ChEMBL_610953 (CHEMBL1070284)
IC50 13000±n/a nM
Citation Rose, NRWoon, ECKingham, GLKing, ONMecinovic, JClifton, IJNg, SSTalib-Hardy, JOppermann, UMcDonough, MASchofield, CJ Selective inhibitors of the JMJD2 histone demethylases: combined nondenaturing mass spectrometric screening and crystallographic approaches. J Med Chem53:1810-8 (2010) 
 
Lysine-specific demethylase 4A
Name:Lysine-specific demethylase 4A
Type:Enzyme
Mol. Mass.:120647.83
Organism:Homo sapiens (Human)
Description:O75164
Residue:1064
BDBM50306581
NameBDBM50306581
Synonyms:(R)-3-(4-(4-tert-butylphenylsulfonyloxy)phenyl)-2-(carboxyformamido)propanoic acid | CHEMBL600221
TypeSmall organic molecule
Emp. Form.C21H23NO8S
Mol. Mass.449.474
SMILESCC(C)(C)c1ccc(cc1)S(=O)(=O)Oc1ccc(C[C@@H](NC(=O)C(O)=O)C(O)=O)cc1